The Heat Pump Ontology (HPOnt).
type: Ontology
license: https://creativecommons.org/licenses/by-nc/4.0/
contributor: Ignacio Lazaro <mailto:ignacio.lazar@tekniker.es> Daniel Coakley <mailto:d.coakley@uk.merce.mee.com> James Freeman <mailto:j.freeman@uk.merce.mee.com> Paulo Lissa <mailto:paulo.lissa@nuigalway.ie>
created: 2021-08-04
creator: Iker Esnaola-Gonzalez <mailto:iker.esnaola@tekniker.es>
description: The Heat Pump Ontology (HPOnt) aims to formalize and represent all the relevant information of Heat Pumps. The HPOnt has been developed as part of the REACT project which has received funding from the European Union’s Horizon 2020 research and innovation programme under grant agreement no. 824395.
description: The Heat Pump Ontology
issued: 2021-08-19
status: Work in Progress
preferred namespace prefix: hpont
preferred namespace uri: https://w3id.org/hpont#
version info: 0.2

has Operating Mode Available
type: ObjectProperty
domain: Heat Pump System
range: Heat Pump Operating Mode
comment: Operating modes available for the Heat Pump
term status: testing

has Technology
type: ObjectProperty
domain: Heat Pump System
range: Heat Pump Technology
comment: Base technology of a given Heat Pump
term status: testing

has Buffer Storage Volume
type: DatatypeProperty
domain: Heat Pump System
comment: Buffer storage volume of the Heat Pump. Buffer storage is thermal energy storage using a tank for the circulating heat transfer fluid of the Heat Pump
term status: testing

has DHW Storage Volume
type: DatatypeProperty
domain: Heat Pump System
comment: DHW (Domestic Hot Water) storage volume of the Heat Pump. DHW storage is a tank that contains clean potable water for household hot water consumption
term status: testing

has Nominal Cooling Capacity
type: DatatypeProperty
domain: Heat Pump System
comment: Nominal cooling capacity of the Heat Pump
term status: testing

has Nominal Heating Capacity
type: DatatypeProperty
domain: Heat Pump System
comment: Nominal heating capacity of the Heat Pump
term status: testing

has Nominal Power Consumption In Cooling Mode
type: DatatypeProperty
domain: Heat Pump System
comment: Nominal power consumption of the Heat Pump when it is in cooling mode
term status: testing

has Nominal Power Consumption In Heating Mode
type: DatatypeProperty
domain: Heat Pump System
comment: Nominal power consumption of the Heat Pump when it is in heating mode
term status: testing

has Number Of Indoor Units
type: DatatypeProperty
domain: Heat Pump System
range: integer
comment: Number of indoor units that the Heat Pump has
term status: testing

has Number Of Outdoor Units
type: DatatypeProperty
domain: Heat Pump System
range: integer
comment: Number of outdoor units that the Heat Pump has
term status: testing

has Outdoor Model Unit Name
type: DatatypeProperty
domain: Heat Pump System
range: string
comment: Name of the oudoor model unit
term status: testing

has Power Supply Type
type: DatatypeProperty
domain: Heat Pump System
comment: Electric power supply type of the Heat Pump System
term status: testing

Heat Pump Operating Mode
type: Class
subclass of: Restriction
  on property: has Operating Mode Available
  some values from: Heat Pump Operating Mode
subclass of: Restriction
  on property: has Technology
  qualified cardinality: 1
  on class: Heat Pump Technology
comment: The operating mode of a given Heat Pump system
term status: testing

Heat Pump System
type: Class
comment: A system composed of one or many devices that transfer heat from a colder area to a hotter area by using mechanical energy
term status: stable

Heat Pump Technology
type: Class
comment: The base technology of a given Heat Pump system
term status: testing

air-to-air
type: NamedIndividual
type: Heat Pump Technology
status: testing
comment: Air-to-air Heat Pump technology.

air-to-water
type: NamedIndividual
type: Heat Pump Technology
status: testing
comment: Air-to-water Heat Pump technology

DHW heating mode
type: NamedIndividual
type: Heat Pump Operating Mode
status: testing
comment: DHW heating operation mode of the Heat Pump

Space cooling mode
type: NamedIndividual
type: Heat Pump Operating Mode
status: testing
comment: Space cooling operation mode of the Heat Pump

Space heating mode
type: NamedIndividual
type: Heat Pump Operating Mode
status: testing
comment: Space heating operation mode of the Heat Pump